Target
Potassium voltage-gated channel subfamily H member 2
Ligand
BDBM50402787
Substrate
Meas. Tech.
ChEMBL_887225 (CHEMBL2215781)
IC50
>10000±n/a nM
Citation
 Rodriguez, ALZhou, YWilliams, RDavid Weaver, CVinson, PNDawson, ESSteckler, TLavreysen, HMackie, CBartolomé, JMMacdonald, GJScott Daniels, JNiswender, CMJones, CKJeffrey Conn, PLindsley, CWStauffer, SR Discovery and SAR of a novel series of non-MPEP site mGlu5 PAMs based on an aryl glycine sulfonamide scaffold. Bioorg Med Chem Lett 22:7388-92 (2012)  
Target
Name:
Potassium voltage-gated channel subfamily H member 2
Synonyms:
1,3-beta-glucan synthase component GLS2 ERG Eag-related protein 1 Ether-a-go-go-related gene (HERG) Ether-a-go-go-related gene potassium channel 1 Ether-a-go-go-related gene potassium channel 1 (hERG1) Ether-a-go-go-related protein 1 H-ERG KCNH2 Potassium voltage-gated channel subfamily H member 2 (hERG) Voltage-gated potassium channel subunit Kv11.1 hERG Potassium Channel 1 | putative potassium channel subunit
Type:
Multi-pass membrane protein
Mol. Mass.:
126672.65
Organism:
Homo sapiens (Human)
Description:
Q12809
Residue:
1159
  
Inhibitor
Name:
BDBM50402787
Synonyms:
CHEMBL2208405
Type:
Small organic molecule
Emp. Form.:
C14H16ClF3N2O3S
Mol. Mass.:
384.802
SMILES:
CS(=O)(=O)N(CC(=O)NCC1CC1)c1cc(ccc1Cl)C(F)(F)F
: