Target
Potassium voltage-gated channel subfamily H member 2
Ligand
BDBM50402816
Substrate
Meas. Tech.
ChEMBL_887250 (CHEMBL2215806)
IC50
398.11±n/a nM
Citation
 Furber, MAlcaraz, LLuckhurst, CBahl, ABeaton, HBowers, KCollington, JDenton, RDonald, DKinchin, EMacDonald, CRigby, ARiley, RSoars, MSpringthorpe, BWebborn, P Discovery and evolution of phenoxypiperidine hydroxyamide dual CCR3/H1 antagonists. Part I. Bioorg Med Chem Lett 22:7702-6 (2012)  
Target
Name:
Potassium voltage-gated channel subfamily H member 2
Synonyms:
1,3-beta-glucan synthase component GLS2 ERG Eag-related protein 1 Ether-a-go-go-related gene (HERG) Ether-a-go-go-related gene potassium channel 1 Ether-a-go-go-related gene potassium channel 1 (hERG1) Ether-a-go-go-related protein 1 H-ERG KCNH2 Potassium voltage-gated channel subfamily H member 2 (hERG) Voltage-gated potassium channel subunit Kv11.1 hERG Potassium Channel 1 | putative potassium channel subunit
Type:
Multi-pass membrane protein
Mol. Mass.:
126672.65
Organism:
Homo sapiens (Human)
Description:
Q12809
Residue:
1159
  
Inhibitor
Name:
BDBM50402816
Synonyms:
CHEMBL2208431
Type:
Small organic molecule
Emp. Form.:
C23H24Cl2N4O4
Mol. Mass.:
491.367
SMILES:
O[C@H](CNC(=O)c1n[nH]c(=O)c2ccccc12)CN1CCC(CC1)Oc1ccc(Cl)c(Cl)c1
: