Target
Alpha-mannosidase 2
Ligand
BDBM50168993
Substrate
Meas. Tech.
ChEMBL_885340 (CHEMBL2215203)
Ki
152470±n/a nM
Citation
 Moorthy, NSBrás, NFRamos, MJFernandes, PA Virtual screening and QSAR study of some pyrrolidine derivatives asa-mannosidase inhibitors for binding feature analysis. Bioorg Med Chem 20:6945-59 (2012)  
Target
Name:
Alpha-mannosidase 2
Synonyms:
Alpha-mannosidase 2A1 Lysosomal acid alpha-mannosidase MAN2A1 Mannosidase alpha class 2A member 1 Mannosyl-oligosaccharide 1,3-1,6-alpha-mannosidase
Type:
Protein
Mol. Mass.:
131156.65
Organism:
Homo sapiens (Human)
Description:
Q16706
Residue:
1144
  
Inhibitor
Name:
BDBM50168993
Synonyms:
(2R,3R,4S)-2-(Benzylamino-methyl)-pyrrolidine-3,4-diol | CHEMBL363475
Type:
Small organic molecule
Emp. Form.:
C12H18N2O2
Mol. Mass.:
222.2835
SMILES:
O[C@H]1CN[C@H](CNCc2ccccc2)[C@H]1O
: