Target
Carnitine O-palmitoyltransferase 1, liver isoform
Ligand
BDBM50403045
Substrate
Meas. Tech.
ChEMBL_887448 (CHEMBL2217057)
IC50
16800000±n/a nM
Citation
 Ceccarelli, SMChomienne, OGubler, MArduini, A Carnitine palmitoyltransferase (CPT) modulators: a medicinal chemistry perspective on 35 years of research. J Med Chem 54:3109-52 (2011)  
Target
Name:
Carnitine O-palmitoyltransferase 1, liver isoform
Synonyms:
CPT I CPT1-L CPT1A_HUMAN Carnitine O-palmitoyltransferase I, liver isoform
Type:
PROTEIN
Mol. Mass.:
88389.31
Organism:
Homo sapiens (Human)
Description:
ChEMBL_887463
Residue:
773
  
Inhibitor
Name:
BDBM50403045
Synonyms:
CHEMBL2216773
Type:
Small organic molecule
Emp. Form.:
C31H48N2O4S
Mol. Mass.:
544.789
SMILES:
COc1ccc(CN2CCN(CCCSc3cc(c(O)c(c3)C(C)(C)C)C(C)(C)C)CC2)c(OC)c1OC
: