Target
Carnitine O-palmitoyltransferase 2, mitochondrial
Ligand
BDBM22984
Substrate
Meas. Tech.
ChEMBL_887437 (CHEMBL2217046)
IC50
>100000±n/a nM
Citation
 Ceccarelli, SMChomienne, OGubler, MArduini, A Carnitine palmitoyltransferase (CPT) modulators: a medicinal chemistry perspective on 35 years of research. J Med Chem 54:3109-52 (2011)  
Target
Name:
Carnitine O-palmitoyltransferase 2, mitochondrial
Synonyms:
CPT2_RAT Cpt-2 | Cpt2
Type:
PROTEIN
Mol. Mass.:
74118.53
Organism:
Rattus norvegicus
Description:
ChEMBL_887443
Residue:
658
  
Inhibitor
Name:
BDBM22984
Synonyms:
(8S,10S)-10-{[(2R,4S,5S,6S)-4-amino-5-hydroxy-6-methyloxan-2-yl]oxy}-6,8,11-trihydroxy-8-(2-hydroxyacetyl)-1-methoxy-5,7,8,9,10,12-hexahydrotetracene-5,12-dione Adriblastina Doxil | Doxorubicin
Type:
Antibiotic
Emp. Form.:
C27H29NO11
Mol. Mass.:
543.5193
SMILES:
COc1cccc2C(=O)c3c(O)c4C[C@](O)(C[C@H](O[C@H]5C[C@H](N)[C@H](O)[C@H](C)O5)c4c(O)c3C(=O)c12)C(=O)CO
: