Target
Follicle-stimulating hormone receptor
Ligand
BDBM50403050
Substrate
Meas. Tech.
ChEMBL_887616 (CHEMBL2217225)
EC50
1±n/a nM
Citation
 Jain, AKVaidya, ARavichandran, VKashaw, SKAgrawal, RK Recent developments and biological activities of thiazolidinone derivatives: a review. Bioorg Med Chem 20:3378-95 (2012)  
Target
Name:
Follicle-stimulating hormone receptor
Synonyms:
FSH-R FSHR_HUMAN Follicle-stimulating hormone receptor LGR1
Type:
PROTEIN
Mol. Mass.:
78273.21
Organism:
Homo sapiens (Human)
Description:
ChEMBL_1351769
Residue:
695
  
Inhibitor
Name:
BDBM50403050
Synonyms:
CHEMBL2216803
Type:
Small organic molecule
Emp. Form.:
C36H32ClN3O5S
Mol. Mass.:
654.174
SMILES:
COc1ccc(CCNC(=O)C[C@H]2S[C@H](N(C2=O)c2ccc(C(N)=O)c(Cl)c2)c2ccc(cc2)C#Cc2ccccc2)cc1OC
: