Target
Phosphatidylinositol 4,5-bisphosphate 3-kinase catalytic subunit delta isoform
Ligand
BDBM50403083
Substrate
Meas. Tech.
ChEMBL_887653 (CHEMBL2217262)
Ki
3±n/a nM
Citation
 Cushing, TDMetz, DPWhittington, DAMcGee, LR PI3Kd and PI3K¿ as targets for autoimmune and inflammatory diseases. J Med Chem 55:8559-81 (2012)  
Target
Name:
Phosphatidylinositol 4,5-bisphosphate 3-kinase catalytic subunit delta isoform
Synonyms:
PI3-kinase p110 subunit delta PI3-kinase subunit p110-delta PIK3CD Phosphatidylinositol 4,5-biphosphate 3-kinase catalytic subunit delta (PIK3CD) Phosphatidylinositol 4,5-bisphosphate 3-kinase 110 kDa catalytic subunit delta (PI3K delta) Phosphatidylinositol 4,5-bisphosphate 3-kinase catalytic subunit delta (PI3Kdelta) Phosphatidylinositol 4,5-bisphosphate 3-kinase catalytic subunit delta isoform (PI3K delta) Phosphatidylinositol 4,5-bisphosphate 3-kinase catalytic subunit delta isoform (PI3K-delta) Phosphatidylinositol 4,5-bisphosphate 3-kinase catalytic subunit delta isoform (PI3Kdelta)
Type:
Enzyme Subunit
Mol. Mass.:
119489.41
Organism:
Homo sapiens (Human)
Description:
O00329
Residue:
1044
  
Inhibitor
Name:
BDBM50403083
Synonyms:
CHEMBL2216850
Type:
Small organic molecule
Emp. Form.:
C23H23N5O2S
Mol. Mass.:
433.526
SMILES:
CCN(CC)C(=O)c1cccc(Nc2nc3ccc(cc3s2)-c2cncc(OC)c2)n1
: