Target
Thromboxane A2 receptor
Ligand
BDBM50403129
Substrate
Meas. Tech.
ChEBML_90019
IC50
1800±n/a nM
Citation
 Klar, UPletsch, A New TXA2/PGH2 receptor antagonists based on the carbacyclin skeleton Bioorg Med Chem Lett 3:199-204 (1993)    Article 
Target
Name:
Thromboxane A2 receptor
Synonyms:
Prostanoid TP receptor TBXA2R Thromboxane Thromboxane Beta
Type:
Enyzme
Mol. Mass.:
37445.28
Organism:
Homo sapiens (Human)
Description:
P21731
Residue:
343
  
Inhibitor
Name:
BDBM50403129
Synonyms:
CHEMBL64229
Type:
Small organic molecule
Emp. Form.:
C21H25Cl2N3O3
Mol. Mass.:
438.348
SMILES:
OC(=O)CCC\C=C1\C[C@H]2CC[C@H](C=NNC(=O)Nc3ccc(Cl)c(Cl)c3)[C@H]2C1
: