Target
Type-1 angiotensin II receptor
Ligand
BDBM50403202
Substrate
Meas. Tech.
ChEMBL_34673 (CHEMBL645254)
Kd
10.72±n/a nM
Citation
 Zydowsky, TMWinn, MDe, BCondon, SLAltenbach, RJBasha, FZBoyd, SABuckner, SAHancock, AALee, JYMantei, RANovosad, EISorensen, BKTasker, ASShiosaki, KKerkman, DJOpgenorth, TJDeBernardis, JF Synthesis and In Vitro evaluation of fused ring heterocyle-containing angiotensin II antagonists. Bioorg Med Chem Lett 4:173-176 (1994)    Article 
Target
Name:
Type-1 angiotensin II receptor
Synonyms:
AGTR1 ANGIOTENSIN AT1 Angiotensin II type 1a (AT-1a) receptor
Type:
Enzyme Catalytic Domain
Mol. Mass.:
41009.15
Organism:
RABBIT
Description:
ANGIOTENSIN AT1 AGTR1 RABBIT::P34976
Residue:
359
  
Inhibitor
Name:
BDBM50403202
Synonyms:
CHEMBL301819
Type:
Small organic molecule
Emp. Form.:
C23H24N10
Mol. Mass.:
440.5037
SMILES:
CCCCN(Cc1ccc(cc1)-c1ccccc1-c1nnn[nH]1)c1ncnc2n(C)nnc12
: