Target
Neprilysin
Ligand
BDBM50048514
Substrate
Meas. Tech.
ChEMBL_144627 (CHEMBL883549)
IC50
400±n/a nM
Citation
 Robl, JASimpkins, LMStevenson, JSun, CMurugesan, NBarrish, JCAsaad, MMBird, JSchaeffer, TRTrippodo, NCPetrillo, EWKaranewsky, DS Dual metalloprotease inhibitors. I. constrained peptidomimetics of mercaptoacyl dipeptides Bioorg Med Chem Lett 4:1789-1794 (1994)    Article 
Target
Name:
Neprilysin
Synonyms:
Atriopeptidase CD_antigen=CD10 EPN MME NEP_HUMAN Neutral endopeptidase | Neutral endopeptidase 24.11
Type:
Enzyme
Mol. Mass.:
85505.38
Organism:
Homo sapiens (Human)
Description:
P08473
Residue:
750
  
Inhibitor
Name:
BDBM50048514
Synonyms:
(S)-1-[(S)-2-((S)-2-Mercapto-3-phenyl-propionylamino)-propionyl]-pyrrolidine-2-carboxylic acid | CHEMBL287896
Type:
Small organic molecule
Emp. Form.:
C17H22N2O4S
Mol. Mass.:
350.433
SMILES:
C[C@H](NC(=O)[C@@H](S)Cc1ccccc1)C(=O)N1CCC[C@H]1C(O)=O
: