Target
Peptidyl-prolyl cis-trans isomerase FKBP1A
Ligand
BDBM50403335
Substrate
Meas. Tech.
ChEBML_66423
Ki
25±n/a nM
Citation
 Yamashita, DSOh, HYen, HBossard, MJBrandt, MLevy, MANewman-Tarr, TBadger, ALuengo, JIHolt, DA Design, synthesis and evaluation of dual domain FKBP ligands Bioorg Med Chem Lett 4:325-328 (1994)    Article 
Target
Name:
Peptidyl-prolyl cis-trans isomerase FKBP1A
Synonyms:
12 kDa FK506-binding protein FK506-binding protein 1A FKB1A_HUMAN FKBP-1A FKBP12 Immunophilin FKBP12 PPIase FKBP1A Rotamase mTOR/FKBP12A/FKBP12B
Type:
Isomerase
Mol. Mass.:
11953.09
Organism:
Homo sapiens (Human)
Description:
P62942
Residue:
108
  
Inhibitor
Name:
BDBM50403335
Synonyms:
CHEMBL325145
Type:
Small organic molecule
Emp. Form.:
C32H45NO7
Mol. Mass.:
555.7022
SMILES:
CC1(C)CCC(=O)CCCCC(=O)OCC(C)(C)C(=O)C(=O)N2CCCC[C@H]2C(=O)O[C@@H]1CCc1ccccc1
: