Target
Gag-Pol polyprotein [489-587]
Ligand
BDBM50403350
Substrate
Meas. Tech.
ChEBML_157883
Ki
53±n/a nM
Citation
 Thompson, SKEppley, AMFrazee, JSDarcy, MGLum, RTTomaszek, TAIvanoff, LAMorris, JFSternberg, EJLambert, DMFernandez, AVPetteway, SRMeek, TDMetcalf, BWGleason, JG Synthesis and antiviral activity of a novel class of HIV-1 protease inhibitors containing a heterocyclic P1-P2 amide bond isostere Bioorg Med Chem Lett 4:2441-2446 (1994)    Article 
Target
Name:
Gag-Pol polyprotein [489-587]
Synonyms:
Human immunodeficiency virus type 1 protease Pol polyprotein | gag-pol
Type:
Enzyme Subunit
Mol. Mass.:
10781.16
Organism:
Human immunodeficiency virus type 1
Description:
P04585[489-587]
Residue:
99
  
Inhibitor
Name:
BDBM50403350
Synonyms:
CHEMBL81190
Type:
Small organic molecule
Emp. Form.:
C31H41N3O4
Mol. Mass.:
519.6749
SMILES:
CCC(C)C(=O)c1cnc([nH]1)[C@@H](C[C@H](O)[C@H](Cc1ccccc1)NC(=O)OC(C)(C)C)Cc1ccccc1
: