Target
Muscarinic acetylcholine receptor M1
Ligand
BDBM50176065
Substrate
Meas. Tech.
ChEMBL_139968 (CHEMBL749023)
Ki
0.588844±n/a nM
Citation
 Tumiatti, VSanti, SRecanatini, MMinarini, AMelchiorre, CChiarini, ABudriesi, R Design, synthesis and biological activity of some 4-DAMP- related compounds Bioorg Med Chem Lett 5:2325-2330 (1995)    Article 
Target
Name:
Muscarinic acetylcholine receptor M1
Synonyms:
ACM1_RAT Chrm-1 cholinergic receptor, muscarinic 1
Type:
Enzyme Catalytic Domain
Mol. Mass.:
51390.46
Organism:
RAT
Description:
P08482
Residue:
460
  
Inhibitor
Name:
BDBM50176065
Synonyms:
4-DAMP Acetic acid 4-[(4-acetoxy-phenyl)-pyridin-2-yl-methyl]-phenyl ester CHEMBL76897
Type:
Small organic molecule
Emp. Form.:
C21H26NO2
Mol. Mass.:
324.4361
SMILES:
C[N+]1(C)CCC(CC1)OC(=O)C(c1ccccc1)c1ccccc1
: