Target
Alpha-2B adrenergic receptor
Ligand
BDBM50403751
Substrate
Meas. Tech.
ChEMBL_32528 (CHEMBL641409)
IC50
4.2±n/a nM
Citation
 Kennis, LEBischoff, FPMertens, CJLove, CJVan den Keybus, FAPieters, SBraeken, MMegens, AALeysen, JE New 2-substituted 1,2,3,4-tetrahydrobenzofuro[3,2-c]pyridine having highly active and potent central alpha 2-antagonistic activity as potential antidepressants. Bioorg Med Chem Lett 10:71-4 (2000)  
Target
Name:
Alpha-2B adrenergic receptor
Synonyms:
ADA2B_HUMAN ADRA2L1 Adrenergic alpha2B Adrenergic receptor alpha Alpha-2 adrenergic receptor subtype C2 Alpha-2B adrenoreceptor | Alpha-2BAR
Type:
Enzyme
Mol. Mass.:
49964.20
Organism:
Homo sapiens (Human)
Description:
P18089
Residue:
450
  
Inhibitor
Name:
BDBM50403751
Synonyms:
CHEMBL162436
Type:
Small organic molecule
Emp. Form.:
C28H25N3O2
Mol. Mass.:
435.517
SMILES:
O=c1c(CCN2CCc3oc4ccccc4c3C2)c(Cc2ccccc2)nc2ccccn12
: