Target
Mu-type opioid receptor
Ligand
BDBM50240679
Substrate
Meas. Tech.
ChEMBL_145456 (CHEMBL751089)
EC50
<10000±n/a nM
Citation
 Santagada, VBalboni, GCaliendo, GGuerrini, RSalvadori, SBianchi, CBryant, SDLazarus, LH Assessment of substitution in the second pharmacophore of Dmt-Tic analogues. Bioorg Med Chem Lett 10:2745-8 (2000)  
Target
Name:
Mu-type opioid receptor
Synonyms:
M-OR-1 Mu opioid receptor OPIATE Mu OPRM_CAVPO
Type:
Enzyme Catalytic Domain
Mol. Mass.:
11165.58
Organism:
GUINEA PIG
Description:
P97266
Residue:
98
  
Inhibitor
Name:
BDBM50240679
Synonyms:
2-Amino-3-(4-hydroxy-2,6-dimethyl-phenyl)-1-(3-hydroxymethyl-3,4-dihydro-1H-isoquinolin-2-yl)-propan-1-one CHEMBL328135
Type:
Small organic molecule
Emp. Form.:
C21H26N2O3
Mol. Mass.:
354.4427
SMILES:
Cc1cc(O)cc(C)c1C[C@H](N)C(=O)N1Cc2ccccc2CC1CO
: