Target
Alpha-2C adrenergic receptor
Ligand
BDBM50421506
Substrate
Meas. Tech.
ChEMBL_33675 (CHEMBL646816)
Ki
<10000±n/a nM
Citation
 Brown, ACarlyle, IClark, JHamilton, WGibson, SMcGarry, GMcEachen, SRae, DThorn, SWalker, G Discovery and SAR of org 24598-a selective glycine uptake inhibitor. Bioorg Med Chem Lett 11:2007-9 (2001)  
Target
Name:
Alpha-2C adrenergic receptor
Synonyms:
ADA2C_HUMAN ADRA2L2 Adrenergic alpha2C Adrenergic receptor alpha Alpha-2 adrenergic receptor subtype C4 Alpha-2C adrenoreceptor | adrenergic, alpha-2C-, receptor [Homo sapiens]
Type:
Enzyme
Mol. Mass.:
49552.32
Organism:
Homo sapiens (Human)
Description:
P18825
Residue:
462
  
Inhibitor
Name:
BDBM50421506
Synonyms:
CHEMBL61861 | ORG-24598
Type:
Small organic molecule
Emp. Form.:
C19H19F3NO3
Mol. Mass.:
366.3548
SMILES:
CN(CC[C@@H](Oc1ccc(cc1)C(F)(F)F)c1ccccc1)CC([O-])=O
: