Target
Histamine H1 receptor
Ligand
BDBM50403988
Substrate
Meas. Tech.
ChEBML_84541
IC50
<1000±n/a nM
Citation
 Andrés, JIAlcázar, JAlonso, JMDíaz, AFernández, JGil, PIturrino, LMatesanz, EMeert, TFMegens, ASipido, VK Synthesis and structure-activity relationship of 2-(aminoalkyl)-2,3,3a,8-tetrahydrodibenzo[c,f]isoxazolo[2,3-a]azepine derivatives: a novel series of 5-HT(2A/2C) receptor antagonists. Part 2. Bioorg Med Chem Lett 12:249-53 (2001)  
Target
Name:
Histamine H1 receptor
Synonyms:
H1R HISTAMINE H1 HRH1_HUMAN
Type:
G Protein-Coupled Receptor (GPCR)
Mol. Mass.:
55808.72
Organism:
Homo sapiens (Human)
Description:
Cell pellets from SK-N-MC cells transfected with human H1 receptor were used in binding assay.
Residue:
487
  
Inhibitor
Name:
BDBM50403988
Synonyms:
CHEMBL86091
Type:
Small organic molecule
Emp. Form.:
C20H21F3N2O
Mol. Mass.:
362.3887
SMILES:
CN(C)CC1CC2N(O1)c1ccccc1Cc1ccc(cc21)C(F)(F)F
: