Target
Muscarinic acetylcholine receptor M2
Ligand
BDBM50403996
Substrate
Meas. Tech.
ChEBML_138225
Ki
200±n/a nM
Citation
 Takadoi, MTerashima, S Synthesis and muscarinic M2 subtype antagonistic activity of unnatural ent-himbacine and an enantiomeric pair of (2'S,6'R)-diepihimbacine. Bioorg Med Chem Lett 12:2871-3 (2002)  
Target
Name:
Muscarinic acetylcholine receptor M2
Synonyms:
ACM2_RAT Chrm-2 | Chrm2
Type:
Enzyme Catalytic Domain
Mol. Mass.:
51555.53
Organism:
RAT
Description:
P10980
Residue:
466
  
Inhibitor
Name:
BDBM50403996
Synonyms:
CHEMBL97765
Type:
Small organic molecule
Emp. Form.:
C22H35NO2
Mol. Mass.:
345.5188
SMILES:
C[C@H]1OC(=O)[C@@H]2C[C@@H]3CCCC[C@H]3[C@H](\C=C\[C@H]3CCC[C@H](C)N3C)[C@H]12
: