Target
Adenosine kinase
Ligand
BDBM50049820
Substrate
Meas. Tech.
ChEBML_31135
IC50
467±n/a nM
Citation
 González, MPMoldes del Carmen Terán, M A TOPS-MODE approach to predict adenosine kinase inhibition. Bioorg Med Chem Lett 14:3077-9 (2004)  
Target
Name:
Adenosine kinase
Synonyms:
ADK | ADK_HUMAN
Type:
PROTEIN
Mol. Mass.:
40545.97
Organism:
Homo sapiens (Human)
Description:
ChEMBL_1467841
Residue:
362
  
Inhibitor
Name:
BDBM50049820
Synonyms:
4-Amino-5-carboxamide-7-(D-ribofuranosyl)pyrrolo[2,3-d]pyrimidine 4-Amino-7-(3,4-dihydroxy-5-hydroxymethyl-tetrahydro-furan-2-yl)-7H-pyrrolo[2,3-d]pyrimidine-5-carboxylic acid amide CHEMBL101892 cid_5153
Type:
Small organic molecule
Emp. Form.:
C12H15N5O5
Mol. Mass.:
309.278
SMILES:
NC(=O)c1cn([C@@H]2O[C@H](CO)[C@@H](O)[C@H]2O)c2ncnc(N)c12
: