Target
Adenosine kinase
Ligand
BDBM50000300
Substrate
Meas. Tech.
ChEBML_31135
IC50
120±n/a nM
Citation
 González, MPMoldes del Carmen Terán, M A TOPS-MODE approach to predict adenosine kinase inhibition. Bioorg Med Chem Lett 14:3077-9 (2004)  
Target
Name:
Adenosine kinase
Synonyms:
ADK | ADK_HUMAN
Type:
PROTEIN
Mol. Mass.:
40545.97
Organism:
Homo sapiens (Human)
Description:
ChEMBL_1467841
Residue:
362
  
Inhibitor
Name:
BDBM50000300
Synonyms:
(2R,3R,4S,5R)-2-(4-Amino-5-bromo-pyrrolo[2,3-d]pyrimidin-7-yl)-5-hydroxymethyl-tetrahydro-furan-3,4-diol 2-(4-Amino-5-bromo-pyrrolo[2,3-d]pyrimidin-7-yl)-5-hydroxymethyl-tetrahydro-furan-3,4-diol 2-(4-Amino-5-bromo-pyrrolo[2,3-d]pyrimidin-7-yl)-5-hydroxymethyl-tetrahydro-furan-3,4-diol(5-Bromotubercidin) | CHEMBL62099
Type:
Small organic molecule
Emp. Form.:
C11H13BrN4O4
Mol. Mass.:
345.149
SMILES:
Nc1ncnc2n(cc(Br)c12)[C@@H]1O[C@H](CO)[C@@H](O)[C@H]1O
: