Target
Neuronal acetylcholine receptor subunit alpha-4/beta-2
Ligand
BDBM50143274
Substrate
Meas. Tech.
ChEMBL_143883 (CHEMBL751866)
Ki
0.300000±n/a nM
Citation
 Glennon, RADukat, M alpha4beta2 nACh receptor pharmacophore models. Bioorg Med Chem Lett 14:1841-4 (2004)  
Target
Name:
Neuronal acetylcholine receptor subunit alpha-4/beta-2
Synonyms:
Neuronal acetylcholine receptor Alpha-4/Beta-2 Neuronal acetylcholine receptor; alpha4/beta2 | nAChR subtypes alpha4 beta2
Type:
Protein
Mol. Mass.:
Description:
Components:
This complex has 2 components.
Component 1
Name:
Neuronal acetylcholine receptor subunit alpha-4
Synonyms:
ACHA4_HUMAN CHRNA4 protein Neuronal acetylcholine receptor protein alpha-4 subunit Nicotinic acetylcholine receptor alpha4/beta2/alpha5
Type:
Mol. Mass.:
69963.49
Organism:
Homo sapiens (Human)
Description:
NACHRA4
Residue:
627
  
Component 2
Name:
Neuronal acetylcholine receptor subunit beta-2
Synonyms:
ACHB2_HUMAN Neuronal acetylcholine receptor protein beta-2 subunit | Nicotinic acetylcholine receptor alpha3/beta2/alpha5
Type:
Protein
Mol. Mass.:
57020.50
Organism:
Homo sapiens (Human)
Description:
P17787
Residue:
502
  
Inhibitor
Name:
BDBM50143274
Synonyms:
3-(4-Methyl-isoxazol-5-ylmethyl)-1-aza-bicyclo[2.2.1]heptane | CHEMBL55114
Type:
Small organic molecule
Emp. Form.:
C11H16N2O
Mol. Mass.:
192.2575
SMILES:
Cc1cnoc1CC1CN2CCC1C2
: