Target
Inosine-5'-monophosphate dehydrogenase
Ligand
BDBM50367005
Substrate
Meas. Tech.
ChEBML_89668
Ki
64000±n/a nM
Citation
 Skibo, EBMeyer, RB Inhibition of inosinic acid dehydrogenase by 8-substituted purine nucleotides. J Med Chem 24:1155-61 (1982)  
Target
Name:
Inosine-5'-monophosphate dehydrogenase
Synonyms:
IMDH_ECOLI guaR
Type:
PROTEIN
Mol. Mass.:
52020.85
Organism:
Escherichia coli (strain K12)
Description:
ChEMBL_89670
Residue:
488
  
Inhibitor
Name:
BDBM50367005
Synonyms:
CHEMBL606014
Type:
Small organic molecule
Emp. Form.:
C19H24N5O7PS
Mol. Mass.:
497.462
SMILES:
Nc1ncnc2n(C3O[C@H](COP(O)(O)=O)[C@@H](O)[C@H]3O)c(SCCCc3ccccc3)nc12
: