Target
5-hydroxytryptamine receptor 2B
Ligand
BDBM50024201
Substrate
Meas. Tech.
ChEMBL_2898 (CHEMBL858114)
Kd
3548.13±n/a nM
Citation
 Domelsmith, LNEaton, TAHouk, KNAnderson, GMGlennon, RAShulgin, ATCastagnoli, NKollman, PA Photoelectron spectra of psychotropic drugs. 6. Relationships between the physical properties and pharmacological actions of amphetamine analogues. J Med Chem 24:1414-21 (1982)  
Target
Name:
5-hydroxytryptamine receptor 2B
Synonyms:
5-HT2B 5HT2B_RAT Serotonin 2b (5-HT2b) receptor Srl
Type:
Enzyme Catalytic Domain
Mol. Mass.:
53668.47
Organism:
RAT
Description:
5-HT2B HTR2B RAT::P30994
Residue:
479
  
Inhibitor
Name:
BDBM50024201
Synonyms:
(+/-)2-(3,4-Dimethoxy-phenyl)-1-methyl-ethylamine 2-(3,4-Dimethoxy-phenyl)-1-methyl-ethylamine CHEMBL277540
Type:
Small organic molecule
Emp. Form.:
C11H17NO2
Mol. Mass.:
195.2582
SMILES:
COc1ccc(CC(C)N)cc1OC
: