Target
Malate dehydrogenase, cytoplasmic
Ligand
BDBM50404701
Substrate
Meas. Tech.
ChEMBL_52262 (CHEMBL665215)
IC50
1202264.43±n/a nM
Citation
 Coats, EAShah, KJMilstein, SRGenther, CSNene, DMRoesener, JSchmidt, JPleiss, MWagner, EBaker, JK 4-hydroxyquinoline-3-carboxylic acids as inhibitors of cell respiration. 2. Quantitative structure-activity relationship of dehydrogenase enzyme and Ehrlich ascites tumor cell inhibitions. J Med Chem 25:57-63 (1982)  
Target
Name:
Malate dehydrogenase, cytoplasmic
Synonyms:
Cytosolic malate dehydrogenase MDHC_PIG Malate dehydrogenase cytoplasmic
Type:
Oxidoreductase; homodimer
Mol. Mass.:
36453.77
Organism:
Sus scrofa (pig)
Description:
Porcine heart cytoplasmic fraction.
Residue:
334
  
Inhibitor
Name:
BDBM50404701
Synonyms:
CHEMBL139244
Type:
Small organic molecule
Emp. Form.:
C10H6N2O5
Mol. Mass.:
234.165
SMILES:
OC(=O)c1cnc2cc(ccc2c1O)[N+]([O-])=O
: