Target
Malate dehydrogenase, cytoplasmic
Ligand
BDBM50404729
Substrate
Meas. Tech.
ChEMBL_52262 (CHEMBL665215)
IC50
154881.66±n/a nM
Citation
 Coats, EAShah, KJMilstein, SRGenther, CSNene, DMRoesener, JSchmidt, JPleiss, MWagner, EBaker, JK 4-hydroxyquinoline-3-carboxylic acids as inhibitors of cell respiration. 2. Quantitative structure-activity relationship of dehydrogenase enzyme and Ehrlich ascites tumor cell inhibitions. J Med Chem 25:57-63 (1982)  
Target
Name:
Malate dehydrogenase, cytoplasmic
Synonyms:
Cytosolic malate dehydrogenase MDHC_PIG Malate dehydrogenase cytoplasmic
Type:
Oxidoreductase; homodimer
Mol. Mass.:
36453.77
Organism:
Sus scrofa (pig)
Description:
Porcine heart cytoplasmic fraction.
Residue:
334
  
Inhibitor
Name:
BDBM50404729
Synonyms:
CHEMBL351540
Type:
Small organic molecule
Emp. Form.:
C18H15NO4
Mol. Mass.:
309.316
SMILES:
OC(=O)c1cnc2cc(OCCc3ccccc3)ccc2c1O
: