Target
Beta-2 adrenergic receptor
Ligand
BDBM25756
Substrate
Meas. Tech.
ChEMBL_38001 (CHEMBL651635)
Kd
162.18±n/a nM
Citation
 Baldwin, JJDenny, GHHirschmann, RFreedman, MBPonticello, GSGross, DMSweet, CS Beta 1-selective adrenoceptor antagonists: examples of the 2-[4-[3-(substituted-amino)-2-hydroxypropoxy]phenyl]imidazole class. J Med Chem 26:950-7 (1983)  
Target
Name:
Beta-2 adrenergic receptor
Synonyms:
ADRB2_CAVPO adrenergic Beta2
Type:
Enzyme Catalytic Domain
Mol. Mass.:
46993.24
Organism:
GUINEA PIG
Description:
adrenergic Beta2 ADRB2 GUINEA PIG::Q8K4Z4
Residue:
418
  
Inhibitor
Name:
BDBM25756
Synonyms:
(2R,3R)-2,3-dihydroxysuccinic acid;1-(isopropylamino)-3-[4-(2-methoxyethyl)phenoxy]propan-2-ol CHEMBL13 Spesicor metoprolol tartrate | {2-hydroxy-3-[4-(2-methoxyethyl)phenoxy]propyl}(propan-2-yl)amine
Type:
Small organic molecule
Emp. Form.:
C15H25NO3
Mol. Mass.:
267.3639
SMILES:
COCCc1ccc(OCC(O)CNC(C)C)cc1
: