Target
Beta-2 adrenergic receptor
Ligand
BDBM25753
Substrate
Meas. Tech.
ChEMBL_38001 (CHEMBL651635)
Kd
1174.9±n/a nM
Citation
 Baldwin, JJDenny, GHHirschmann, RFreedman, MBPonticello, GSGross, DMSweet, CS Beta 1-selective adrenoceptor antagonists: examples of the 2-[4-[3-(substituted-amino)-2-hydroxypropoxy]phenyl]imidazole class. J Med Chem 26:950-7 (1983)  
Target
Name:
Beta-2 adrenergic receptor
Synonyms:
ADRB2_CAVPO adrenergic Beta2
Type:
Enzyme Catalytic Domain
Mol. Mass.:
46993.24
Organism:
GUINEA PIG
Description:
adrenergic Beta2 ADRB2 GUINEA PIG::Q8K4Z4
Residue:
418
  
Inhibitor
Name:
BDBM25753
Synonyms:
2-{4-[2-hydroxy-3-(propan-2-ylamino)propoxy]phenyl}acetamide Atenolol Tenormin | Tenormine
Type:
Small organic molecule
Emp. Form.:
C14H22N2O3
Mol. Mass.:
266.3361
SMILES:
CC(C)NCC(O)COc1ccc(CC(N)=O)cc1
: