Target
Beta-2 adrenergic receptor
Ligand
BDBM50405012
Substrate
Meas. Tech.
ChEMBL_37999 (CHEMBL651633)
Kd
8.91±n/a nM
Citation
 Bouzoubaa, MLeclerc, GDecker, NSchwartz, JAndermann, G Synthesis and beta-adrenergic blocking activity of new aliphatic and alicyclic oxime ethers. J Med Chem 27:1291-4 (1984)  
Target
Name:
Beta-2 adrenergic receptor
Synonyms:
ADRB2_CAVPO adrenergic Beta2
Type:
Enzyme Catalytic Domain
Mol. Mass.:
46993.24
Organism:
GUINEA PIG
Description:
adrenergic Beta2 ADRB2 GUINEA PIG::Q8K4Z4
Residue:
418
  
Inhibitor
Name:
BDBM50405012
Synonyms:
CHEMBL24644
Type:
Small organic molecule
Emp. Form.:
C17H32N2O3
Mol. Mass.:
312.4476
SMILES:
CC(C)(C)NCC(O)CO\N=C(\CC(=O)C(C)(C)C)C1CC1
: