Target
Beta-2 adrenergic receptor
Ligand
BDBM50405013
Substrate
Meas. Tech.
ChEMBL_37999 (CHEMBL651633)
Kd
2.14±n/a nM
Citation
 Bouzoubaa, MLeclerc, GDecker, NSchwartz, JAndermann, G Synthesis and beta-adrenergic blocking activity of new aliphatic and alicyclic oxime ethers. J Med Chem 27:1291-4 (1984)  
Target
Name:
Beta-2 adrenergic receptor
Synonyms:
ADRB2_CAVPO adrenergic Beta2
Type:
Enzyme Catalytic Domain
Mol. Mass.:
46993.24
Organism:
GUINEA PIG
Description:
adrenergic Beta2 ADRB2 GUINEA PIG::Q8K4Z4
Residue:
418
  
Inhibitor
Name:
BDBM50405013
Synonyms:
CHEMBL285972
Type:
Small organic molecule
Emp. Form.:
C14H26N2O2
Mol. Mass.:
254.3684
SMILES:
[#6]C([#6])([#6])[#7]-[#6]-[#6](-[#8])-[#6]-[#8]\[#7]=[#6](/[#6]-1-[#6]-[#6]1)-[#6]-1-[#6]-[#6]-1
: