Target
Dihydrofolate reductase
Ligand
BDBM50405049
Substrate
Meas. Tech.
ChEBML_53616
Ki
74±n/a nM
Citation
 Hansch, CHathaway, BAGuo, ZRSelassie, CDDietrich, SWBlaney, JMLangridge, RVolz, KWKaufman, BT Crystallography, quantitative structure-activity relationships, and molecular graphics in a comparative analysis of the inhibition of dihydrofolate reductase from chicken liver and Lactobacillus casei by 4,6-diamino-1,2-dihydro-2,2-dimethyl-1-(substituted-phenyl)-s-triazine s. J Med Chem 27:129-43 (1984)  
Target
Name:
Dihydrofolate reductase
Synonyms:
1.5.1.3 DYR_CHICK
Type:
Mol. Mass.:
21652.69
Organism:
Gallus gallus (Chicken)
Description:
Residue:
189
  
Inhibitor
Name:
BDBM50405049
Synonyms:
CHEMBL285019
Type:
Small organic molecule
Emp. Form.:
C18H20ClN5S
Mol. Mass.:
373.903
SMILES:
CC1(C)N=C(N)N=C(N)N1c1ccc(SCc2ccc(Cl)cc2)cc1
: