Target
Adenosylhomocysteinase
Ligand
BDBM50006215
Substrate
Meas. Tech.
ChEBML_197202
Ki
41±n/a nM
Citation
 Narayanan, SRKeller, BTBorcherding, DRScholtz, SABorchardt, RT 9-(trans-2',trans-3'-dihydroxycyclopent-4'-enyl) derivatives of adenine and 3-deazaadenine: potent inhibitors of bovine liver S-adenosylhomocysteine hydrolase. J Med Chem 31:500-3 (1988)  
Target
Name:
Adenosylhomocysteinase
Synonyms:
AHCY SAHH | SAHH_HUMAN
Type:
PROTEIN
Mol. Mass.:
47714.06
Organism:
Homo sapiens (Human)
Description:
ChEMBL_1507791
Residue:
432
  
Inhibitor
Name:
BDBM50006215
Synonyms:
(1'R,2'S,3'R)-9-(2',3'-dihydroxycyclopent-4'-enyl)adenine 5-(6-Amino-purin-9-yl)-cyclopent-3-ene-1,2-diol | CHEMBL299961
Type:
Small organic molecule
Emp. Form.:
C10H11N5O2
Mol. Mass.:
233.2266
SMILES:
Nc1ncnc2n(cnc12)[C@@H]1C=C[C@@H](O)[C@H]1O
: