Target
Lutropin-choriogonadotropic hormone receptor
Ligand
BDBM50227963
Substrate
Meas. Tech.
ChEMBL_100135 (CHEMBL712414)
Ki
759±n/a nM
Citation
 Haviv, FPalabrica, CABush, ENDiaz, GJohnson, ESLove, SGreer, J Active reduced-size hexapeptide analogues of luteinizing hormone-releasing hormone. J Med Chem 32:2340-4 (1989)  
Target
Name:
Lutropin-choriogonadotropic hormone receptor
Synonyms:
LH/CG-R LSHR_RAT Luteinizing hormone receptor Lutropin-choriogonadotropic hormone receptor
Type:
PROTEIN
Mol. Mass.:
78049.26
Organism:
Rattus norvegicus
Description:
ChEMBL_97289
Residue:
700
  
Inhibitor
Name:
BDBM50227963
Synonyms:
CHEMBL2369781
Type:
Small organic molecule
Emp. Form.:
C48H68N10O9
Mol. Mass.:
929.1151
SMILES:
[#6]-[#6]-[#7]-[#6](=O)-[#6@@H]-1-[#6]-[#6]-[#6]-[#7]-1-[#6](=O)-[#6@H](-[#6]-[#6]-[#6]\[#7]=[#6](/[#7])-[#7])-[#7]-[#6](=O)-[#6@H](-[#6]-[#6](-[#6])-[#6])-[#7]-[#6](=O)-[#6@@H](-[#6]-[#6](-[#6])-[#6])-[#7]-[#6](=O)-[#6@H](-[#6]-c1ccc(-[#8])cc1)-[#7]-[#6](=O)-[#6@H](-[#6]-[#8])-[#7]-[#6](=O)-c1cccc2ccccc12
: