Target
Dihydrofolate reductase
Ligand
BDBM50405969
Substrate
Meas. Tech.
ChEBML_54926
Ki
316±n/a nM
Citation
 Selassie, CDFang, ZXLi, RLHansch, CDebnath, GKlein, TELangridge, RKaufman, BT On the structure selectivity problem in drug design. A comparative study of benzylpyrimidine inhibition of vertebrate and bacterial dihydrofolate reductase via molecular graphics and quantitative structure-activity relationships. J Med Chem 32:1895-905 (1989)  
Target
Name:
Dihydrofolate reductase
Synonyms:
DYR_LACCA folA
Type:
PROTEIN
Mol. Mass.:
18437.08
Organism:
Lactobacillus casei
Description:
ChEMBL_1357878
Residue:
163
  
Inhibitor
Name:
BDBM50405969
Synonyms:
CHEMBL57160
Type:
Small organic molecule
Emp. Form.:
C20H30N4O2
Mol. Mass.:
358.4778
SMILES:
CCCCCCCCOc1cc(Cc2cnc(N)nc2N)ccc1OC
: