Target
Dihydrofolate reductase
Ligand
BDBM50405978
Substrate
Meas. Tech.
ChEBML_53614
Ki
186209±n/a nM
Citation
 Selassie, CDFang, ZXLi, RLHansch, CDebnath, GKlein, TELangridge, RKaufman, BT On the structure selectivity problem in drug design. A comparative study of benzylpyrimidine inhibition of vertebrate and bacterial dihydrofolate reductase via molecular graphics and quantitative structure-activity relationships. J Med Chem 32:1895-905 (1989)  
Target
Name:
Dihydrofolate reductase
Synonyms:
1.5.1.3 DYR_CHICK
Type:
Mol. Mass.:
21652.69
Organism:
Gallus gallus (Chicken)
Description:
Residue:
189
  
Inhibitor
Name:
BDBM50405978
Synonyms:
CHEMBL19672
Type:
Small organic molecule
Emp. Form.:
C11H13N5
Mol. Mass.:
215.2544
SMILES:
Nc1ccc(Cc2cnc(N)nc2N)cc1
: