Target
Dihydrofolate reductase
Ligand
BDBM50029763
Substrate
Meas. Tech.
ChEBML_54926
Ki
47±n/a nM
Citation
 Selassie, CDFang, ZXLi, RLHansch, CDebnath, GKlein, TELangridge, RKaufman, BT On the structure selectivity problem in drug design. A comparative study of benzylpyrimidine inhibition of vertebrate and bacterial dihydrofolate reductase via molecular graphics and quantitative structure-activity relationships. J Med Chem 32:1895-905 (1989)  
Target
Name:
Dihydrofolate reductase
Synonyms:
DYR_LACCA folA
Type:
PROTEIN
Mol. Mass.:
18437.08
Organism:
Lactobacillus casei
Description:
ChEMBL_1357878
Residue:
163
  
Inhibitor
Name:
BDBM50029763
Synonyms:
5-(3,5-Diethoxy-4-pyrrol-1-yl-benzyl)-pyrimidine-2,4-diamine Epiroprim | TCMDC-137295
Type:
Small organic molecule
Emp. Form.:
C19H23N5O2
Mol. Mass.:
353.4182
SMILES:
CCOc1cc(Cc2cnc(N)nc2N)cc(OCC)c1-n1cccc1
: