Target
Dihydrofolate reductase
Ligand
BDBM77567
Substrate
Meas. Tech.
ChEBML_54926
Ki
427±n/a nM
Citation
 Selassie, CDFang, ZXLi, RLHansch, CDebnath, GKlein, TELangridge, RKaufman, BT On the structure selectivity problem in drug design. A comparative study of benzylpyrimidine inhibition of vertebrate and bacterial dihydrofolate reductase via molecular graphics and quantitative structure-activity relationships. J Med Chem 32:1895-905 (1989)  
Target
Name:
Dihydrofolate reductase
Synonyms:
DYR_LACCA folA
Type:
PROTEIN
Mol. Mass.:
18437.08
Organism:
Lactobacillus casei
Description:
ChEMBL_1357878
Residue:
163
  
Inhibitor
Name:
BDBM77567
Synonyms:
5-(4-Butoxy-benzyl)-pyrimidine-2,4-diamine MLS001049199 [2-amino-5-(4-butoxybenzyl)pyrimidin-4-yl]amine | cid_623352
Type:
Small organic molecule
Emp. Form.:
C15H20N4O
Mol. Mass.:
272.3455
SMILES:
CCCCOc1ccc(Cc2cnc(N)nc2N)cc1
: