Target
Dihydrofolate reductase
Ligand
BDBM50029760
Substrate
Meas. Tech.
ChEBML_54926
Ki
550±n/a nM
Citation
 Selassie, CDFang, ZXLi, RLHansch, CDebnath, GKlein, TELangridge, RKaufman, BT On the structure selectivity problem in drug design. A comparative study of benzylpyrimidine inhibition of vertebrate and bacterial dihydrofolate reductase via molecular graphics and quantitative structure-activity relationships. J Med Chem 32:1895-905 (1989)  
Target
Name:
Dihydrofolate reductase
Synonyms:
DYR_LACCA folA
Type:
PROTEIN
Mol. Mass.:
18437.08
Organism:
Lactobacillus casei
Description:
ChEMBL_1357878
Residue:
163
  
Inhibitor
Name:
BDBM50029760
Synonyms:
5-[3,5-Dimethoxy-4-(2-methoxy-ethoxy)-benzyl]-pyrimidine-2,4-diamine CHEMBL32039 | Tetroxoprim
Type:
Small organic molecule
Emp. Form.:
C16H22N4O4
Mol. Mass.:
334.3703
SMILES:
COCCOc1c(OC)cc(Cc2cnc(N)nc2N)cc1OC
: