Target
Dihydrofolate reductase
Ligand
BDBM50405976
Substrate
Meas. Tech.
ChEMBL_54726 (CHEMBL668339)
Ki
95±n/a nM
Citation
 Selassie, CDLi, RLPoe, MHansch, C On the optimization of hydrophobic and hydrophilic substituent interactions of 2,4-diamino-5-(substituted-benzyl)pyrimidines with dihydrofolate reductase. J Med Chem 34:46-54 (1991)  
Target
Name:
Dihydrofolate reductase
Synonyms:
1.5.1.3 folA | t0090
Type:
PROTEIN
Mol. Mass.:
17976.56
Organism:
Salmonella enterica subsp. enterica serovar Typhi
Description:
ChEMBL_13019
Residue:
159
  
Inhibitor
Name:
BDBM50405976
Synonyms:
CHEMBL19790
Type:
Small organic molecule
Emp. Form.:
C12H11F3N4
Mol. Mass.:
268.2377
SMILES:
Nc1ncc(Cc2cccc(c2)C(F)(F)F)c(N)n1
: