Target
Dihydrofolate reductase
Ligand
BDBM50405962
Substrate
Meas. Tech.
ChEMBL_54726 (CHEMBL668339)
Ki
589±n/a nM
Citation
 Selassie, CDLi, RLPoe, MHansch, C On the optimization of hydrophobic and hydrophilic substituent interactions of 2,4-diamino-5-(substituted-benzyl)pyrimidines with dihydrofolate reductase. J Med Chem 34:46-54 (1991)  
Target
Name:
Dihydrofolate reductase
Synonyms:
1.5.1.3 folA | t0090
Type:
PROTEIN
Mol. Mass.:
17976.56
Organism:
Salmonella enterica subsp. enterica serovar Typhi
Description:
ChEMBL_13019
Residue:
159
  
Inhibitor
Name:
BDBM50405962
Synonyms:
CHEMBL19772
Type:
Small organic molecule
Emp. Form.:
C11H11FN4
Mol. Mass.:
218.2302
SMILES:
Nc1ncc(Cc2cccc(F)c2)c(N)n1
: