Target
Polyunsaturated fatty acid 5-lipoxygenase
Ligand
BDBM50009004
Substrate
Meas. Tech.
ChEMBL_98489 (CHEMBL879813)
EC50
30800±n/a nM
Citation
 Bruneau, PDelvare, CEdwards, MPMcMillan, RM Indazolinones, a new series of redox-active 5-lipoxygenase inhibitors with built-in selectivity and oral activity. J Med Chem 34:1028-36 (1991)  
Target
Name:
Polyunsaturated fatty acid 5-lipoxygenase
Synonyms:
5-LO 5-Lipoxygenase (5-LO) 5-Lipoygenase ALOX5 LOG5 | LOX5_HUMAN
Type:
Enzyme
Mol. Mass.:
77972.74
Organism:
Homo sapiens (Human)
Description:
Recombinant protein was purified from E. coli lysate. After ammonium sulfate precipitation and subsequent steps, the supernatant (S100) was used for 5-LO activity assay.
Residue:
674
  
Inhibitor
Name:
BDBM50009004
Synonyms:
(phenidone)1-Phenyl-pyrazolidin-3-one 1-Phenyl-pyrazolidin-3-one (Phenidone) 1-phenylpyrazolidin-3-one PHENIDONE
Type:
Small organic molecule
Emp. Form.:
C9H10N2O
Mol. Mass.:
162.1885
SMILES:
O=C1CCN(N1)c1ccccc1
: