Target
Adenosine receptor A2a/A2b
Ligand
BDBM50406512
Substrate
Meas. Tech.
ChEMBL_27633 (CHEMBL639509)
EC50
5.5±n/a nM
Citation
 Ueeda, MThompson, RDArroyo, LHOlsson, RA 2-aralkoxyadenosines: potent and selective agonists at the coronary artery A2 adenosine receptor. J Med Chem 34:1340-4 (1991)  
Target
Name:
Adenosine receptor A2a/A2b
Synonyms:
Adenosine A2 receptor
Type:
Mol. Mass.:
Description:
ASSAY_ID of ChEMBL is 329906
Components:
This complex has 2 components.
Component 1
Name:
Adenosine receptor A2b
Synonyms:
AA2BR_HUMAN ADORA2B Adenosine receptors A2b | Adenosine receptors; A2a & A2b
Type:
G Protein-Coupled Receptor (GPCR)
Mol. Mass.:
36341.22
Organism:
Homo sapiens (Human)
Description:
Residue:
332
  
Component 2
Name:
Adenosine receptor A2a
Synonyms:
A2A adenosine receptor (hA2A) ADENOSINE A2 ADORA2 Adenosine A2A receptor (A2AAR)
Type:
G Protein-Coupled Receptor (GPCR)
Mol. Mass.:
44716.46
Organism:
Homo sapiens (Human)
Description:
P29274
Residue:
412
  
Inhibitor
Name:
BDBM50406512
Synonyms:
CHEMBL603587
Type:
Small organic molecule
Emp. Form.:
C18H20ClN5O5
Mol. Mass.:
421.835
SMILES:
Nc1nc(OCCc2ccccc2Cl)nc2n(cnc12)C1O[C@@H](CO)[C@H](O)[C@@H]1O
: