Target
7-dehydrocholesterol reductase
Ligand
BDBM50406619
Substrate
Meas. Tech.
ChEBML_53601
Ki
2000±n/a nM
Citation
 Ator, MASchmidt, SJAdams, JLDolle, REKruse, LIFrey, CLBarone, JM Synthesis, specificity, and antifungal activity of inhibitors of the Candida albicans delta 24-sterol methyltransferase. J Med Chem 35:100-6 (1992)  
Target
Name:
7-dehydrocholesterol reductase
Synonyms:
DHCR7_RAT | Dhcr7
Type:
PROTEIN
Mol. Mass.:
54168.97
Organism:
Rattus norvegicus
Description:
ChEMBL_53595
Residue:
471
  
Inhibitor
Name:
BDBM50406619
Synonyms:
CHEMBL9808
Type:
Small organic molecule
Emp. Form.:
C26H44OS
Mol. Mass.:
404.692
SMILES:
CC(C)SCC[C@@H](C)C1CCC2C3CC=C4C[C@@H](O)CC[C@]4(C)C3CC[C@]12C
: