Target
Histamine H2 receptor
Ligand
BDBM50406645
Substrate
Meas. Tech.
ChEMBL_85511 (CHEMBL696492)
Ki
9.8±n/a nM
Citation
 Hirschfeld, JBuschauer, AElz, SSchunack, WRuat, MTraiffort, ESchwartz, JC Iodoaminopotentidine and related compounds: a new class of ligands with high affinity and selectivity for the histamine H2 receptor. J Med Chem 35:2231-8 (1992)  
Target
Name:
Histamine H2 receptor
Synonyms:
Gastric receptor I HISTAMINE H2 HRH2_CAVPO | Histamine H2-Gs alpha S
Type:
G Protein-Coupled Receptor (GPCR)
Mol. Mass.:
40567.22
Organism:
Cavia porcellus (domestic guinea pig)
Description:
For the H2 receptor-binding assays, guinea pig striatum was used.
Residue:
359
  
Inhibitor
Name:
BDBM50406645
Synonyms:
AMINOPOTENTIDINE
Type:
Small organic molecule
Emp. Form.:
C26H35N7O2
Mol. Mass.:
477.6018
SMILES:
Nc1ccc(cc1)C(=O)NCCNC(NCCCOc1cccc(CN2CCCCC2)c1)=NC#N
: