Target
Angiotensin-converting enzyme
Ligand
BDBM50021312
Substrate
Meas. Tech.
ChEBML_36150
IC50
49±n/a nM
Citation
 Waller, CLMarshall, GR Three-dimensional quantitative structure-activity relationship of angiotesin-converting enzyme and thermolysin inhibitors. II. A comparison of CoMFA models incorporating molecular orbital fields and desolvation free energies based on active-analog and complementary-receptor-field alignment rules. J Med Chem 36:2390-403 (1993)  
Target
Name:
Angiotensin-converting enzyme
Synonyms:
ACE Angiotensin converting enzyme (ACE) Angiotensin-converting enzyme, soluble form CD_antigen=CD143 DCP1 Kininase II
Type:
Enzyme
Mol. Mass.:
149709.01
Organism:
Homo sapiens (Human)
Description:
Residue:
1306
  
Inhibitor
Name:
BDBM50021312
Synonyms:
1-(2-Mercapto-cyclobutanecarbonyl)-pyrrolidine-2-carboxylic acid | CHEMBL336561
Type:
Small organic molecule
Emp. Form.:
C10H15NO3S
Mol. Mass.:
229.296
SMILES:
OC(=O)[C@@H]1CCCN1C(=O)[C@@H]1CC[C@H]1S
: