Target
Gag-Pol polyprotein [489-587]
Ligand
BDBM50005689
Substrate
Meas. Tech.
ChEMBL_158033 (CHEMBL768257)
IC50
20±n/a nM
Citation
 Waller, CLOprea, TIGiolitti, AMarshall, GR Three-dimensional QSAR of human immunodeficiency virus (I) protease inhibitors. 1. A CoMFA study employing experimentally-determined alignment rules. J Med Chem 36:4152-60 (1994)  
Target
Name:
Gag-Pol polyprotein [489-587]
Synonyms:
Human immunodeficiency virus type 1 protease Pol polyprotein | gag-pol
Type:
Enzyme Subunit
Mol. Mass.:
10781.16
Organism:
Human immunodeficiency virus type 1
Description:
P04585[489-587]
Residue:
99
  
Inhibitor
Name:
BDBM50005689
Synonyms:
BDBM50456284 {1-[1-Benzyl-3-(2-tert-butylcarbamoyl-pyrrolidin-1-yl)-2,3-dioxo-propylcarbamoyl]-2-carbamoyl-ethyl}-carbamic acid benzyl ester
Type:
Small organic molecule
Emp. Form.:
C31H39N5O7
Mol. Mass.:
593.6707
SMILES:
CC(C)(C)NC(=O)[C@@H]1CCCN1C(=O)C(=O)[C@H](Cc1ccccc1)NC(=O)[C@H](CC(N)=O)NC(=O)OCc1ccccc1
: