Target
Gag-Pol polyprotein [489-587]
Ligand
BDBM50422010
Substrate
Meas. Tech.
ChEMBL_158033 (CHEMBL768257)
IC50
63±n/a nM
Citation
 Waller, CLOprea, TIGiolitti, AMarshall, GR Three-dimensional QSAR of human immunodeficiency virus (I) protease inhibitors. 1. A CoMFA study employing experimentally-determined alignment rules. J Med Chem 36:4152-60 (1994)  
Target
Name:
Gag-Pol polyprotein [489-587]
Synonyms:
Human immunodeficiency virus type 1 protease Pol polyprotein | gag-pol
Type:
Enzyme Subunit
Mol. Mass.:
10781.16
Organism:
Human immunodeficiency virus type 1
Description:
P04585[489-587]
Residue:
99
  
Inhibitor
Name:
BDBM50422010
Synonyms:
CHEMBL2304146
Type:
Small organic molecule
Emp. Form.:
C44H66N8O8
Mol. Mass.:
835.0436
SMILES:
CC[C@@H](C)[C@H](NC(=O)[C@H](C(C)C)C(O)C(O)[C@H](CC(C)C)NC(=O)[C@H](Cc1cnc[nH]1)NC(=O)[C@H](Cc1ccccc1)NC(=O)OC(C)(C)C)C(=O)NCc1ccccn1
: