Target
Gag-Pol polyprotein [489-587]
Ligand
BDBM50407042
Substrate
Meas. Tech.
ChEMBL_158033 (CHEMBL768257)
IC50
126.18±n/a nM
Citation
 Waller, CLOprea, TIGiolitti, AMarshall, GR Three-dimensional QSAR of human immunodeficiency virus (I) protease inhibitors. 1. A CoMFA study employing experimentally-determined alignment rules. J Med Chem 36:4152-60 (1994)  
Target
Name:
Gag-Pol polyprotein [489-587]
Synonyms:
Human immunodeficiency virus type 1 protease Pol polyprotein | gag-pol
Type:
Enzyme Subunit
Mol. Mass.:
10781.16
Organism:
Human immunodeficiency virus type 1
Description:
P04585[489-587]
Residue:
99
  
Inhibitor
Name:
BDBM50407042
Synonyms:
CHEMBL278875
Type:
Small organic molecule
Emp. Form.:
C33H44N6O5
Mol. Mass.:
604.7397
SMILES:
CCCCN(C[C@@H](O)[C@H](Cc1ccccc1)NC(=O)[C@H](CC(N)=O)NC(=O)c1ccc2ccccc2n1)C(=O)NCC(C)C
: