Target
Cholecystokinin receptor type A
Ligand
BDBM50019187
Substrate
Meas. Tech.
ChEMBL_50035 (CHEMBL666755)
IC50
1.41±n/a nM
Citation
 Tokarski, JSHopfinger, AJ Three-dimensional molecular shape analysis-quantitative structure-activity relationship of a series of cholecystokinin-A receptor antagonists. J Med Chem 37:3639-54 (1994)  
Target
Name:
Cholecystokinin receptor type A
Synonyms:
CCKAR_RAT Cholecystokinin peripheral Cholecystokinin receptor type A
Type:
Enzyme Catalytic Domain
Mol. Mass.:
49676.37
Organism:
RAT
Description:
Cholecystokinin central 0 RAT::P30551
Residue:
444
  
Inhibitor
Name:
BDBM50019187
Synonyms:
(R)-1H-Indole-2-carboxylic acid [5-(2-fluoro-phenyl)-1-methyl-2-oxo-2,3-dihydro-1H-benzo[e][1,4]diazepin-3-yl]-amide: 0.1C4H10O 1H-Indole-2-carboxylic acid [5-(2-fluoro-phenyl)-1-methyl-2-oxo-2,3-dihydro-1H-benzo[e][1,4]diazepin-3-yl]-amide CHEMBL73522
Type:
Small organic molecule
Emp. Form.:
C25H19FN4O2
Mol. Mass.:
426.4424
SMILES:
CN1c2ccccc2C(=NC(NC(=O)c2cc3ccccc3[nH]2)C1=O)c1ccccc1F
: