Target
Cholecystokinin receptor type A
Ligand
BDBM50407252
Substrate
Meas. Tech.
ChEMBL_50035 (CHEMBL666755)
IC50
89.13±n/a nM
Citation
 Tokarski, JSHopfinger, AJ Three-dimensional molecular shape analysis-quantitative structure-activity relationship of a series of cholecystokinin-A receptor antagonists. J Med Chem 37:3639-54 (1994)  
Target
Name:
Cholecystokinin receptor type A
Synonyms:
CCKAR_RAT Cholecystokinin peripheral Cholecystokinin receptor type A
Type:
Enzyme Catalytic Domain
Mol. Mass.:
49676.37
Organism:
RAT
Description:
Cholecystokinin central 0 RAT::P30551
Residue:
444
  
Inhibitor
Name:
BDBM50407252
Synonyms:
CHEMBL420722
Type:
Small organic molecule
Emp. Form.:
C23H19FN4O2
Mol. Mass.:
402.421
SMILES:
Fc1ccccc1C1=NC(NC(=O)CNc2ccccc2)C(=O)Nc2ccccc12
: