Target
Vasopressin V1a receptor
Ligand
BDBM50407332
Substrate
Meas. Tech.
ChEMBL_214569 (CHEMBL818694)
Kd
6.92±n/a nM
Citation
 Manning, MCheng, LLKlis, WABalaspiri, LOlma, ASawyer, WHWo, NCChan, WY Effects of a D-Cys6/L-Cys6 interchange in nonselective and selective vasopressin and oxytocin antagonists. J Med Chem 38:1762-9 (1995)  
Target
Name:
Vasopressin V1a receptor
Synonyms:
Avpr1a VASOPRESSIN V1A Vasopressin V1a receptor | Vasopressin receptor
Type:
Enzyme Catalytic Domain
Mol. Mass.:
47674.81
Organism:
RAT
Description:
VASOPRESSIN V1A AVPR1A RAT::P30560
Residue:
424
  
Inhibitor
Name:
BDBM50407332
Synonyms:
CHEMBL405005
Type:
Small organic molecule
Emp. Form.:
C53H77N13O11S2
Mol. Mass.:
1136.389
SMILES:
CCN1[C@@H](Cc2ccc(O)cc2)C(=O)N[C@H](Cc2ccccc2)C(=O)N[C@@H](C(C)C)C(=O)N[C@H](CC(N)=O)C(=O)N[C@@H](CSSC2(CCCCC2)CC1=O)C(=O)N1CCC[C@H]1C(=O)N[C@@H](CCCNC(N)=N)C(=O)NCC(N)=O
: